{"text_format":"1","workbook":"xlsx","n_sheets":4,"sheets":["審判員名簿","委嘱状（審判員本人用）","学校長","所属長"],"not_rendered":{"charts":0,"images":0,"macros":1,"external_links":0,"defined_names":5,"comments":0,"pivot_tables":0},"unopened":[],"bounds":{"document_bytes":16777216,"sheet_cells":100000,"rows_first":2000,"rows_last":500,"rows_between":2000,"halvings":0,"cell_chars":16384,"cell_head_chars":4096},"cells_cut":0,"cells_raw":0,"read":"whole","date_system":"1900"}

{"sheet":"審判員名簿","index":0,"n_rows":243,"n_cols":4,"rows_kept":243,"cut":false,"hidden":false,"merged":[]}
["番号","審判・役職","氏名","勤務先・学校"]
[1,"総務","本田貢"]
[2,"総務員（全体　抗議）","玉井康夫"]
[3,"総務員（トラック）","北村裕美"]
[4,"総務員（跳躍）","高平将臣"]
[5,"総務員（投擲）","更科亮輔"]
[6,"総務員（庶務）兼役員係兼庶務係兼報道係","大泉凡"]
[7,"技術総務","大道裕昭"]
[8,"ジュリー","岡部壽一"]
[9,"ジュリー","佐藤良幸"]
[10,"ジュリー","南條裕二"]
[11,"審判長（トラック）","関口勝彦"]
[12,"審判長（スタート）","新井田守"]
[13,"審判長（跳躍）","赤松幸広"]
[14,"審判長（投擲）","瀧澤龍一"]
[15,"審判長（招集所）","児島享史"]
[16,"アナウンサー（主任）","伊藤由紀子"]
[17,"アナウンサー","安曇範子"]
[18,"アナウンサー","伊藤浩紀"]
[19,"記録・情報処理員兼番組編成員（主任）","番匠徹"]
[20,"記録・情報処理員兼番組編成員（主任）","松田圭司"]
[21,"記録・情報処理員兼番組編成員兼補助員係","佐藤和敏"]
[22,"記録・情報処理員兼番組編成員","柴田諒"]
[23,"記録・情報処理員兼番組編成員","野村菜那"]
[24,"記録・情報処理員兼番組編成員","増田倖弥"]
[25,"マーシャル（主任）","関根慎治"]
[26,"マーシャル","橘由希"]
[27,"マーシャル","藤村咲月"]
[28,"マーシャル","高橋唯月"]
[29,"マーシャル","清野乎眞"]
[30,"マーシャル","佐藤柊也"]
[31,"競技者係（主任）","中山慎哉"]
[32,"競技者係","田辺修司"]
[33,"競技者係","平野篤史"]
[34,"競技者係","小野依希"]
[35,"競技者係","林暖華"]
[36,"競技者係","高橋萌果"]
[37,"競技者係","波平莉子"]
[38,"競技者係","若松璃音"]
[39,"役員係兼庶務係兼報道係（主任）兼補助員係","木下正大"]
[40,"役員係兼庶務係兼報道係兼補助員係","羽生亜紀"]
[41,"医務員（主任）","麻生詩織"]
[42,"式典表彰係（主任）","伊藤睦美"]
[43,"式典表彰係","嵐伊紗那"]
[44,"公式計測員兼用器具係","天野宗夫"]
[45,"用器具係（主任）","村越秀逸"]
[46,"用器具係","町田裕太"]
[47,"用器具係","村松健二"]
[48,"用器具係","杉野幸志"]
[49,"用器具係","若松璃音"]
[50,"風力計測員（主任）","遠山駿文"]
[51,"風力計測員","今村考佑"]
[52,"風力計測員","益子暖基"]
[53,"風力計測員","池田和聡"]
[54,"風力計測員","伊藤陽向"]
[55,"風力計測員","大久保琉輝夢"]
[56,"写真判定員（主任）","村上智一"]
[57,"写真判定員","岩上公作"]
[58,"写真判定員","佐藤強"]
[59,"監察員（主任）","岡本祐真"]
[60,"監察員","古田仁"]
[61,"監察員","佐藤吉治"]
[62,"監察員","田中清孝"]
[63,"監察員","中川喬介"]
[64,"監察員","中塚龍星"]
[65,"監察員","赤沼奏音"]
[66,"監察員","岩崎佑希"]
[67,"スターター（リコーラー）（主任）","大南央恵"]
[68,"スターター（リコーラー）（主任）","山辺功志"]
[69,"スターター（リコーラー）","太田愛菜"]
[70,"スターター（リコーラー）","久保宏貴"]
[71,"スターター（リコーラー）","田中佳行"]
[72,"スターター（リコーラー）","長谷川航大"]
[73,"スターター（リコーラー）","角谷良孝"]
[74,"スターター（リコーラー）","上山碧来"]
[75,"出発係（主任）","弓場由紀子"]
[76,"出発係","矢島恵介"]
[77,"出発係","髙橋昌也"]
[78,"出発係","宍戸政彦"]
[79,"出発係","高橋秀典"]
[80,"出発係","斎藤莉々愛"]
[81,"出発係","原田玲乃"]
[82,"出発係","松崎心美"]
[83,"出発係","片山瑛心"]
[84,"周回記録員（主任）","片岡祐介"]
[85,"周回記録員","伊藤一晟"]
[86,"周回記録員","風間公佑"]
[87,"周回記録員","白澤桜真"]
[88,"周回記録員","工藤咲来"]
[89,"跳躍審判員（主任）","阿部丈人"]
[90,"跳躍審判員","山本勇太"]
[91,"跳躍審判員","菅野功一"]
[92,"跳躍審判員","小林敏美"]
[93,"跳躍審判員","沼倉正広"]
[94,"跳躍審判員","増田一真"]
[95,"跳躍審判員","中西麻実"]
[96,"跳躍審判員","伊藤千尋"]
[97,"跳躍審判員","近藤一広"]
[98,"跳躍審判員","須藤敏明"]
[99,"跳躍審判員","日裏徹也"]
[100,"跳躍審判員","岩田学"]
[101,"跳躍審判員","鈴木勝博"]
[102,"跳躍審判員","叶内健太"]
[103,"跳躍審判員","遠藤優陽"]
[104,"跳躍審判員","酒井慶樹"]
[105,"投擲審判員（主任）","阿部冬彩"]
[106,"投擲審判員","鈴木小絢"]
[107,"投擲審判員","工藤遥澄"]
[108,"投擲審判員","平船忠明"]
[109,"投擲審判員","森祥真"]
[110,"投擲審判員","山端悠"]
[111,"投擲審判員","成瀬遥斗"]
[112,"投擲審判員","川田昴芽"]
[113,"科学計測員（主任）","山下大輔"]
[114,"科学計測員","佐藤優一"]
[115]
[116]
[117]
[117]
[118]
[119]
[120]
[121]
[122]
[123]
[124]
[125]
[126]
[127]
[128]
[129]
[130]
[131]
[132]
[133]
[134]
[135]
[136]
[137]
[138]
[139]
[140]
[141]
[142]
[143]
[145]
[146]
[147]
[148]
[149]
[150]
[151]
[152]
[153]
[154]
[155]
[156]
[157]
[158]
[159]
[160]
[161]
[162]
[163]
[164]
[165]
[166]
[167]
[168]
[169]
[170]
[171]
[172]
[173]
[174]
[175]
[176]
[177]
[178]
[179]
[180]
[181]
[182]
[183]
[184]
[185]
[186]
[187]
[188]
[189]
[190]
[191]
[192]
[193]
[194]
[195]
[196]
[197]
[198]
[199]
[200]
[201]
[202]
[203]
[204]
[205]
[206]
[207]
[208]
[209]
[210]
[211]
[212]
[213]
[214]
[215]
[216]
[217]
[218]
[219]
[220]
[221]
[222]
[223]
[224]
[225]
[226]
[227]
[228]
[229]
[230]
[231]
[232]
[233]
[234]
[235]
[236]
[237]
[238]
[239]
[240]
[241]
[242]

{"sheet":"委嘱状（審判員本人用）","index":1,"n_rows":66,"n_cols":27,"rows_kept":66,"cut":false,"hidden":false,"merged":[[22,1,22,6],[19,11,19,18],[0,26,2,26],[13,28,15,28],[13,29,15,29],[3,1,3,7],[3,26,6,26],[13,26,15,26],[13,27,15,27],[4,2,4,6],[1,19,1,23],[7,16,7,23],[16,1,16,23],[17,1,17,23],[18,1,18,23],[21,1,21,23],[19,1,19,10],[6,16,6,18],[6,19,6,23],[5,16,5,23],[8,16,8,18],[8,19,8,23]]}
[null,null,null,null,null,null,null,null,null,null,null,null,null,null,null,null,null,null,null,null,null,null,null,null,null,null,"番号"]
[null,null,null,null,null,null,null,null,null,null,null,null,null,null,null,null,null,null,null,"令和８年６月吉日"]
[]
[null,{"$f":"IF(VLOOKUP(AA4,審判員名簿!$A$2:$D$243,4,FALSE)=0,\"\",VLOOKUP(AA4,審判員名簿!$A$2:$D$243,4,FALSE))","v":{"$error":"#N/A"}}]
[null,null,{"$f":"IF(VLOOKUP(AA4,審判員名簿!$A$2:$C$243,3,FALSE)=0,\"\",VLOOKUP(AA4,審判員名簿!$A$2:$C$243,3,FALSE))","v":{"$error":"#N/A"}},null,null,null,null,null,"様"]
[null,null,null,null,null,null,null,null,null,null,null,null,null,null,null,null,"一般財団法人北海道陸上競技協会"]
[null,null,null,null,null,null,null,null,null,null,null,null,null,null,null,null,"会　　　長",null,null,"品 　田 　吉 　博"]
[null,null,null,null,null,null,null,null,null,null,null,null,null,null,null,null,"釧 路 地 方 陸 上 競 技 協 会"]
[null,null,null,null,null,null,null,null,null,null,null,null,null,null,null,null,"会　    長",null,null,"　𣳾　 地　 浩　 幸"]
[]
[]
[]
[]
[null,null,"  第３９回南部忠平記念陸上競技大会　競技役員の派遣依頼について"]
[]
[]
[null,"　夏至の候、皆様におかれましては益々ご清栄のこととお喜び申し上げます。日頃より、当協会"]
[null,"の事業運営に際しまして、ご支援とご協力を賜り、厚く御礼申し上げます。"]
[null,"　さて、標記大会を釧路市民陸上競技場を会場として、下記日程で開催することとなりました。"]
[null,"　つきましては貴殿を本大会の競技役員",null,null,null,null,null,null,null,null,null,{"$f":"IF(VLOOKUP(AA4,審判員名簿!$A$2:$C$243,2,FALSE)=0,\"\",VLOOKUP(AA4,審判員名簿!$A$2:$C$243,2,FALSE))","v":{"$error":"#N/A"}},null,null,null,null,null,null,null,"としてご委嘱いたし"]
[null,"ます。"]
[null,"　時節柄ご多忙のこととは存じますが、ご了承の上、本大会の運営業務にご協力下さいますよう"]
[null,"お願い致します。"]
[null,null,null,null,null,null,null,null,null,null,null,null,"記"]
[]
[null,null,1,"大会名",null,null,"第３９回南部忠平記念陸上競技大会　"]
[]
[null,null,2,"会　期",null,null,"令和８年７月５日（日）"]
[]
[null,null,3,"会　場",null,null,"釧路市民陸上競技場　"]
[]
[null,null,null,null,null,null,"　〒085-0064　北海道釧路市広里13　 TEL 0154-37-7772"]
[]
[null,null,4,"主　管",null,null,"釧路地方陸上競技協会"]
[]
[null,null,5,"日　程",null,null,"７月５日（日）",null,null,null,null,"審判受付",null,null,null,7,"時","00","分","～"]
[]
[null,null,null,null,null,null,null,null,null,null,null,"審判員集合",null,null,null,7,"時","45","分"]
[]
[null,null,null,null,null,null,null,null,null,null,null,"主任審判打合せ  ",null,null,null,7,"時","45","分","（選手招集所）"]
[]
[null,null,null,null,null,null,null,null,null,null,null,"全体打ち合わせ",null,null,null,8,"時","00","分","（本部前）"]
[]
[null,null,null,null,null,null,null,null,null,null,null,"開始式　　",null,null,null,8,"時","40","分"]
[]
[null,null,null,null,null,null,null,null,null,null,null,"競技開始　　",null,null,null,9,"時","00","分"]
[]
[]
[]
[null,null,6,"その他"]
[]
[null,null,"・","役員係で受付を行い審判手帳を提出してください。"]
[]
[null,null,"・","競技場内では公認審判章及び受付で配布されるＩＤを身につけてください。"]
[]
[null,null,"・","審判員の服装については道陸協指定のポロシャツなど、紺を基調とした統一感ある服装の"]
[]
[null,null,null,"着用にご協力ください。"]
[]
[null,null,"・","スターターの上衣の色はオレンジになります。"]
[]
[null,null,"・","審判業務中、選手への声掛けなど【助力】とみなされる行動がないようにしてください。"]
[]
[null,null,"・","昼食については配布される審判ＩＤを引換所でご提示ください。"]
[]
[null,null,"・","経費削減、業務縮減から礼状の発送を省略させていただきます。ご理解ください。"]

{"sheet":"学校長","index":2,"n_rows":42,"n_cols":29,"rows_kept":42,"cut":false,"hidden":false,"merged":[[0,19,0,23],[16,16,16,21],[0,27,1,27],[9,29,10,29],[9,30,10,30],[2,1,2,6],[9,27,10,27],[9,28,10,28],[2,27,5,27],[5,16,5,18],[5,19,5,23],[7,16,7,18],[7,19,7,23],[4,16,4,23],[6,16,6,23],[20,1,20,6],[13,1,13,23],[14,1,14,23],[15,1,15,23],[19,1,19,23],[17,6,17,13],[17,14,17,22]]}
[null,null,null,null,null,null,null,null,null,null,null,null,null,null,null,null,null,null,null,{"$f":"'委嘱状（審判員本人用）'!T2","v":"令和８年６月吉日"},null,null,null,null,null,null,null,"番号"]
[]
[null,{"$f":"IF(VLOOKUP(AB3,審判員名簿!$A$2:$D$243,4,FALSE)=0,\"\",VLOOKUP(AB3,審判員名簿!$A$2:$D$243,4,FALSE))","v":{"$error":"#N/A"}},null,null,null,null,null,null,null,null,null,null,null,null,null,null,null,null,null,null,null,null,null,null,null,null,null,null,"."]
[null,null,null,null,"　校　長　様"]
[null,null,null,null,null,null,null,null,null,null,null,null,null,null,null,null,"一般財団法人北海道陸上競技協会"]
[null,null,null,null,null,null,null,null,null,null,null,null,null,null,null,null,"会　　　長",null,null,"　品　田　吉　博"]
[null,null,null,null,null,null,null,null,null,null,null,null,null,null,null,null,"釧 路 地 方 陸 上 競 技 協 会"]
[null,null,null,null,null,null,null,null,null,null,null,null,null,null,null,null,"会　　　長",null,null,"　𣳾　地　浩　幸"]
[]
[]
[null,null,null,"第３９回南部忠平記念陸上競技大会　競技役員の派遣依頼について"]
[]
[]
[null,"　夏至の候、貴職におかれましては益々ご清栄のこととお喜び申し上げます。日頃より、当協会"]
[null,"の事業運営に際しまして、ご支援とご協力を賜り、厚く御礼申し上げます。"]
[null,"　さて、標記大会を釧路市民陸上競技場を会場として、下記日程で開催することとなりました。"]
[null,"　ここに大会開催のご案内を申し上げますとともに、貴下職員",null,null,null,null,null,null,null,null,null,null,null,null,null,null,{"$f":"IF(VLOOKUP(AB3,審判員名簿!$A$2:$C$243,3,FALSE)=0,\"\",VLOOKUP(AB3,審判員名簿!$A$2:$C$243,3,FALSE))","v":{"$error":"#N/A"}},null,null,null,null,null,"様を"]
[null,"本大会の競技役員",null,null,null,null,{"$f":"IF(VLOOKUP(AB3,審判員名簿!$A$2:$C$243,2,FALSE)=0,\"\",VLOOKUP(AB3,審判員名簿!$A$2:$C$243,2,FALSE))","v":{"$error":"#N/A"}},null,null,null,null,null,null,null,"としてご委嘱いたしますので、派遣"]
[null,"くださるようお願い申し上げます。"]
[null,"　時節柄ご多忙のこととは存じますが、ご了承の上、本大会の運営業務へのご協力下さいます"]
[null,"ようお願い致します。"]
[null,null,null,null,null,null,null,null,null,null,null,null,"記"]
[]
[null,null,1,"大会名",null,null,"第３９回南部忠平記念陸上競技大会　"]
[]
[null,null,2,"会　期",null,null,"令和８年７月５日（日）"]
[]
[null,null,3,"会　場",null,null,"釧路市民陸上競技場　〒085-0064　北海道釧路市広里13　 TEL 0154-37-7772"]
[]
[null,null,4,"主　管",null,null,"釧路地方陸上競技協会"]
[]
[null,null,5,"日　程",null,null,"７月５日（日）",null,null,null,null,"審判受付",null,null,null,7,"時","00","分","～"]
[]
[null,null,null,null,null,null,null,null,null,null,null,"審判員集合",null,null,null,7,"時","45","分"]
[]
[null,null,null,null,null,null,null,null,null,null,null,"主任審判打合せ  ",null,null,null,7,"時","45","分","（選手招集所）"]
[]
[null,null,null,null,null,null,null,null,null,null,null,"全体打ち合わせ",null,null,null,8,"時","00","分","（本部前）"]
[]
[null,null,null,null,null,null,null,null,null,null,null,"開始式　　",null,null,null,8,"時","40","分"]
[]
[null,null,null,null,null,null,null,null,null,null,null,"競技開始　　",null,null,null,9,"時","00","分"]

{"sheet":"所属長","index":3,"n_rows":42,"n_cols":29,"rows_kept":42,"cut":false,"hidden":false,"merged":[[19,1,19,23],[20,1,20,6],[0,19,0,23],[6,16,6,23],[7,16,7,18],[7,19,7,23],[14,1,14,23],[15,1,15,23],[16,16,16,21],[13,1,13,23],[17,6,17,13],[17,14,17,22],[0,27,1,27],[9,29,10,29],[9,30,10,30],[2,1,2,6],[2,27,5,27],[9,27,10,27],[9,28,10,28],[4,16,4,23],[5,16,5,18],[5,19,5,23]]}
[null,null,null,null,null,null,null,null,null,null,null,null,null,null,null,null,null,null,null,{"$f":"'委嘱状（審判員本人用）'!T2","v":"令和８年６月吉日"},null,null,null,null,null,null,null,"番号"]
[]
[null,{"$f":"IF(VLOOKUP(AB3,審判員名簿!$A$2:$D$243,4,FALSE)=0,\"\",VLOOKUP(AB3,審判員名簿!$A$2:$D$243,4,FALSE))","v":{"$error":"#N/A"}},null,null,null,null,null,null,null,null,null,null,null,null,null,null,null,null,null,null,null,null,null,null,null,null,null,null,"."]
[null,null,null,null,"　所属長　様"]
[null,null,null,null,null,null,null,null,null,null,null,null,null,null,null,null,"一般財団法人北海道陸上競技協会"]
[null,null,null,null,null,null,null,null,null,null,null,null,null,null,null,null,"会　　　長",null,null,"　品　田　吉　博"]
[null,null,null,null,null,null,null,null,null,null,null,null,null,null,null,null,"釧 路 地 方 陸 上 競 技 協 会"]
[null,null,null,null,null,null,null,null,null,null,null,null,null,null,null,null,"会　　　長",null,null,"　𣳾　地　浩　幸"]
[]
[]
[null,null,null,"第３９回南部忠平記念陸上競技大会　競技役員の派遣依頼について"]
[]
[]
[null,"　夏至の候、貴職におかれましては益々ご清栄のこととお喜び申し上げます。日頃より、当協会"]
[null,"の事業運営に際しまして、ご支援とご協力を賜り、厚く御礼申し上げます。"]
[null,"　さて、標記大会を釧路市民陸上競技場を会場として、下記日程で開催することとなりました。"]
[null,"　ここに大会開催のご案内を申し上げますとともに、貴下職員",null,null,null,null,null,null,null,null,null,null,null,null,null,null,{"$f":"IF(VLOOKUP(AB3,審判員名簿!$A$2:$C$243,3,FALSE)=0,\"\",VLOOKUP(AB3,審判員名簿!$A$2:$C$243,3,FALSE))","v":{"$error":"#N/A"}},null,null,null,null,null,"様を"]
[null,"本大会の競技役員",null,null,null,null,{"$f":"IF(VLOOKUP(AB3,審判員名簿!$A$2:$C$243,2,FALSE)=0,\"\",VLOOKUP(AB3,審判員名簿!$A$2:$C$243,2,FALSE))","v":{"$error":"#N/A"}},null,null,null,null,null,null,null,"としてご委嘱いたしますので、派遣"]
[null,"くださるようお願い申し上げます。"]
[null,"　時節柄ご多忙のこととは存じますが、ご了承の上、本大会の運営業務へのご協力下さいます"]
[null,"ようお願い致します。"]
[null,null,null,null,null,null,null,null,null,null,null,null,"記"]
[]
[null,null,1,"大会名",null,null,"第３９回南部忠平記念陸上競技大会　"]
[]
[null,null,2,"会　期",null,null,"令和８年７月５日（日）"]
[]
[null,null,3,"会　場",null,null,"釧路市民陸上競技場　〒085-0064　北海道釧路市広里13　 TEL 0154-37-7772"]
[]
[null,null,4,"主　管",null,null,"釧路地方陸上競技協会"]
[]
[null,null,5,"日　程",null,null,"７月５日（日）",null,null,null,null,"審判受付",null,null,null,7,"時","00","分","～"]
[]
[null,null,null,null,null,null,null,null,null,null,null,"審判員集合",null,null,null,7,"時","45","分"]
[]
[null,null,null,null,null,null,null,null,null,null,null,"主任審判打合せ  ",null,null,null,7,"時","45","分","（選手招集所）"]
[]
[null,null,null,null,null,null,null,null,null,null,null,"全体打ち合わせ",null,null,null,8,"時","00","分","（本部前）"]
[]
[null,null,null,null,null,null,null,null,null,null,null,"開始式　　",null,null,null,8,"時","40","分"]
[]
[null,null,null,null,null,null,null,null,null,null,null,"競技開始　　",null,null,null,9,"時","00","分"]