{"text_format":"1","workbook":"xlsx","n_sheets":4,"sheets":["審判員名簿","委嘱状（審判員本人用）","学校長","所属長"],"not_rendered":{"charts":0,"images":0,"macros":1,"external_links":0,"defined_names":4,"comments":0,"pivot_tables":0},"unopened":[],"bounds":{"document_bytes":16777216,"sheet_cells":100000,"rows_first":2000,"rows_last":500,"rows_between":2000,"halvings":0,"cell_chars":16384,"cell_head_chars":4096},"cells_cut":0,"cells_raw":0,"read":"whole","date_system":"1900"}

{"sheet":"審判員名簿","index":0,"n_rows":233,"n_cols":4,"rows_kept":233,"cut":false,"hidden":false,"merged":[]}
["番号","審判・役職","氏名","勤務先・学校"]
[1,"総務","本田　　貢"]
[2,"総務員（全体）","弓塲由紀子"]
[3,"総務員（トラック）","髙澤　　健"]
[4,"総務員（跳躍）","矢野　慎吾"]
[5,"総務員（投擲）","玉井　康夫"]
[6,"総務員（庶務）役員係兼庶務係兼報道係（主任）","大泉　　凡"]
[7,"総務員","中田　光哉"]
[8,"技術総務","村越　秀逸"]
[9,"ジュリー","佐藤　良幸"]
[10,"ジュリー","間宮　政喜"]
[11,"審判長（トラック）","大道　裕昭"]
[12,"審判長（スタート）","上村　　卓"]
[13,"審判長（跳躍）","飯島　進也"]
[14,"審判長（投擲）","瀧澤　龍一"]
[15,"アナウンサー（主任）","伊藤由紀子"]
[16,"アナウンサー（主任）兼競歩審判員","伊藤　浩紀"]
[17,"アナウンサー","豊田　裕子"]
[18,"アナウンサー","畑　　昌吾"]
[19,"アナウンサー","矢花　　哲"]
[20,"アナウンサー","渋谷　俊之"]
[21,"アナウンサー","本間　一徳"]
[22,"記録・情報処理員（主任）","番匠　　徹"]
[23,"記録・情報処理員（主任）","西川真之亮"]
[24,"記録・情報処理員兼競歩審判員","谷　　寿和"]
[25,"記録・情報処理員","溝江　敦樹"]
[26,"番組編成員（主任）","松田　圭司"]
[27,"マーシャル（主任）","藤崎　秀昭"]
[28,"マーシャル","安原　晃司"]
[29,"マーシャル","水島　亮太"]
[30,"マーシャル兼競歩審判員（主任）","竹林貴久夫"]
[31,"競技者係（主任）","児島　享史"]
[32,"競技者係（主任）","後藤　　洋"]
[33,"競技者係","中山　慎哉"]
[34,"競技者係","大沼龍之介"]
[35,"競技者係","高野　賢一"]
[36,"競技者係","福田　　凛"]
[37,"競技者係","山本　知美"]
[38,"競技者係","遠藤　和明"]
[39,"競技者係","内藤　志音"]
[40,"競技者係","児玉　愼司"]
[41,"役員係兼庶務係兼報道係兼補助員係（主任）","羽生　亜紀"]
[42,"役員係兼庶務係兼報道係兼補助員係","松澤　　亮"]
[43,"役員係兼庶務係兼報道係兼補助員係","植地　大樹"]
[44,"医務員（主任）","本田　結花"]
[45,"式典表彰係（主任）","髙久　佳子"]
[46,"式典表彰係","永井　大志"]
[47,"用器具係（主任）","田中　悠登"]
[48,"用器具係","天野　宗夫"]
[49,"風力計測員（主任）","高橋　央匡"]
[50,"風力計測員（主任）","遠山　駿文"]
[51,"風力計測員","小野　立貴"]
[52,"風力計測員","藤原　弘樹"]
[53,"風力計測員","福澤　麗子"]
[54,"風力計測員","本田真里子"]
[55,"写真判定員（主任）","村上　智一"]
[56,"写真判定員","菅原　翔太"]
[57,"写真判定員","増田　尚将"]
[58,"監察員（主任）","関根　慎治"]
[59,"監察員","中村　和生"]
[60,"監察員","佐々木昌博"]
[61,"監察員","宇月原貴光"]
[62,"監察員","田中　佳行"]
[63,"監察員","今井　秀駿"]
[64,"監察員","柴田　康平"]
[65,"スターター（リコーラー）（主任）","山辺　功志"]
[66,"スターター（リコーラー）","高橋　香帆"]
[67,"スターター（リコーラー）","後藤　俊輔"]
[68,"スターター（リコーラー）兼競歩審判員","金澤　孝志"]
[69,"スターター（リコーラー）","勝見　慶吾"]
[70,"スターター（リコーラー）","肥田　政博"]
[71,"スターター（リコーラー）兼競歩審判員","稲葉　康典"]
[72,"スターター（リコーラー）","廣島　　晋"]
[73,"スターター（リコーラー）","月岡　秀美"]
[74,"出発係（主任）","及川　善民"]
[75,"出発係（主任）兼補助員係","佐藤　和敏"]
[76,"出発係","滝澤　拓海"]
[77,"出発係","二木　順也"]
[78,"出発係兼競歩審判員","川村純一朗"]
[79,"出発係","綿谷みなも"]
[80,"出発係","金澤　世凪"]
[81,"出発係","小見　陽哉"]
[82,"出発係兼競歩審判員","有益　宏樹"]
[83,"出発係","美谷　園子"]
[84,"出発係","益子　暖基"]
[85,"周回記録員（主任）","斉藤　政昭"]
[86,"周回記録員","片岡　祐介"]
[87,"周回記録員","高橋　昌也"]
[88,"周回記録員","成田　裕朋"]
[89,"周回記録員","菱倉　真哉"]
[90,"周回記録員","吉田　牧人"]
[91,"跳躍審判員（走幅跳）（主任）","髙平　将臣"]
[92,"跳躍審判員（走高跳）（主任）","沼倉　正広"]
[93,"跳躍審判員（棒高跳）（主任）","阿部　丈人"]
[94,"跳躍審判員","山手新太郎"]
[95,"跳躍審判員","南条　裕二"]
[96,"跳躍審判員","石館　亮一"]
[97,"跳躍審判員","木村　圭祐"]
[98,"跳躍審判員","安倍　典子"]
[99,"跳躍審判員","髙橋　佑弥"]
[100,"跳躍審判員","馬場　佳隆"]
[101,"跳躍審判員","小西　康道"]
[102,"跳躍審判員","京谷　萌子"]
[103,"跳躍審判員","石田　　勝"]
[104,"跳躍審判員","西田　竜斗"]
[105,"跳躍審判員","桑田　佑哉"]
[106,"跳躍審判員","新井　辰典"]
[107,"跳躍審判員","岩田　　学"]
[108,"跳躍審判員","髙橋友紀子"]
[109,"投擲審判員（主任）","更科　亮輔"]
[110,"投擲審判員（主任）","上見　篤司"]
[111,"投擲審判員","山下　大輔"]
[112,"投擲審判員","髙橋　優太"]
[113,"投擲審判員","工藤　遥澄"]
[114,"投擲審判員","鈴木　小絢"]
[115,"投擲審判員","池田　冬乃"]
[116,"投擲審判員","大垣　　崇"]
[117,"投擲審判員","大西　崇文"]
[118,"投擲審判員","益井　康臣"]
[119,"投擲審判員","小山内　弘"]
[120,"投擲審判員","赤松　広隆"]
[121,"投擲審判員","西山　修一"]
[122,"投擲審判員","坂井　博幸"]
[123,"投擲審判員","森　　純一"]
[124,"投擲審判員","富樫　　勝"]
[125,"投擲審判員","阿部　冬彩"]
[126]
[127]
[128]
[129]
[130]
[131]
[132]
[133]
[134]
[135]
[136]
[137]
[138]
[139]
[140]
[141]
[142]
[143]
[144]
[145]
[146]
[147]
[148]
[149]
[150]
[151]
[152]
[153]
[154]
[155]
[156]
[157]
[158]
[159]
[160]
[161]
[162]
[163]
[164]
[165]
[166]
[167]
[168]
[169]
[170]
[171]
[172]
[173]
[174]
[175]
[176]
[177]
[178]
[179]
[180]
[181]
[182]
[183]
[184]
[185]
[186]
[187]
[188]
[189]
[190]
[191]
[192]
[193]
[194]
[195]
[196]
[197]
[198]
[199]
[200]
[201]
[202]
[203]
[204]
[205]
[206]
[207]
[208]
[209]
[210]
[211]
[212]
[213]
[214]
[215]
[216]
[217]
[218]
[219]
[220]
[221]
[222]
[223]
[224]
[225]
[226]
[227]
[228]
[229]
[230]
[231]
[232]

{"sheet":"委嘱状（審判員本人用）","index":1,"n_rows":62,"n_cols":27,"rows_kept":62,"cut":false,"hidden":false,"merged":[[0,26,2,26],[13,28,14,28],[13,29,14,29],[19,11,19,15],[3,1,3,7],[3,26,6,26],[13,26,14,26],[13,27,14,27],[4,2,4,6]]}
[null,null,null,null,null,null,null,null,null,null,null,null,null,null,null,null,null,null,null,null,null,null,null,null,null,null,"番号"]
[null,null,null,null,null,null,null,null,null,null,null,null,null,null,null,null,null,null,"令和６年　７月吉日"]
[]
[null,{"$f":"IF(VLOOKUP(AA4,審判員名簿!$A$2:$D$233,4,FALSE)=0,\"\",VLOOKUP(AA4,審判員名簿!$A$2:$D$233,4,FALSE))","v":{"$error":"#N/A"}}]
[null,null,{"$f":"IF(VLOOKUP(AA4,審判員名簿!$A$2:$C$233,3,FALSE)=0,\"\",VLOOKUP(AA4,審判員名簿!$A$2:$C$233,3,FALSE))","v":{"$error":"#N/A"}},null,null,null,null,null,"様"]
[null,null,null,null,null,null,null,null,null,null,null,null,null,null,null,"一般財団法人北海道陸上競技協会"]
[null,null,null,null,null,null,null,null,null,null,null,null,null,null,null,null,"会　長",null,"　板　谷　良　久"]
[null,null,null,null,null,null,null,null,null,null,null,null,null,null,null,null,"釧路地方陸上競技協会"]
[null,null,null,null,null,null,null,null,null,null,null,null,null,null,null,null,"会　長",null,"　間　宮　政　喜"]
[]
[]
[]
[]
[null,null,"令和６年度国民スポーツ大会北海道代表選手選考会　競技役員の派遣依頼について"]
[]
[null,"　大暑の候、益々ご清栄のこととお喜び申し上げます。日頃より北海道陸上競技協会並びに当協会"]
[null,"の事業運営に際しまして、ご支援とご協力を賜り、厚く御礼申し上げます。"]
[null,"　さて、令和６年度国民スポーツ大会北海道代表選手選考会は、釧路市民陸上競技場を会場として、"]
[null,"下記の日程で開催することとなりました。"]
[null,"　つきましては貴殿を本大会の競技役員",null,null,null,null,null,null,null,null,null,{"$f":"IF(VLOOKUP(AA4,審判員名簿!$A$2:$C$233,2,FALSE)=0,\"\",VLOOKUP(AA4,審判員名簿!$A$2:$C$233,2,FALSE))","v":{"$error":"#N/A"}},null,null,null,null,"としてご委嘱いたします。"]
[null,"　時節柄ご多忙のこととは存じますが、ご了承の上、本大会の運営業務へのご協力下さいますよう"]
[null,"お願い致します。"]
[null,null,null,null,null,null,null,null,null,null,null,null,"記"]
[]
[null,null,1,"大会名",null,null,"令和６年度国民スポーツ大会北海道代表選手選考会"]
[]
[null,null,2,"会　期",null,null,"令和６年　８月１０日（土）・１１日（日）"]
[]
[null,null,3,"会　場",null,null,"釧路市民陸上競技場　〒085-0064　北海道釧路市広里13　 TEL 0154-37-7772"]
[]
[null,null,4,"主　管",null,null,"釧路地方陸上競技協会"]
[]
[null,null,5,"日　程",null,null,"【１日目】８月１０日（土）",null,null,null,null,null,null,"審判集合",null,null,null,7,"時","50","分"]
[]
[null,null,null,null,null,null,null,null,null,null,null,null,null,"主任審判打合せ",null,null,null,8,"時","00","分"]
[]
[null,null,null,null,null,null,null,null,null,null,null,null,null,"開始式",null,null,null,8,"時","10","分"]
[]
[null,null,null,null,null,null,null,null,null,null,null,null,null,"審判打合せ  ",null,null,null,"開始式終了後"]
[]
[null,null,null,null,null,null,null,null,null,null,null,null,null,null,"※パートごとに打ち合わせ"]
[]
[null,null,null,null,null,null,null,null,null,null,null,null,null,"競技開始　　",null,null,null,9,"時","00","分"]
[]
[]
[]
[null,null,null,null,null,null,"【２日目】８月１１日（日）",null,null,null,null,null,null,"審判集合",null,null,null,7,"時","50","分"]
[]
[null,null,null,null,null,null,null,null,null,null,null,null,null,"主任審判打合せ  ",null,null,null,8,"時","00","分"]
[]
[null,null,null,null,null,null,null,null,null,null,null,null,null,"審判打合せ  ",null,null,null,8,"時","10","分"]
[]
[null,null,null,null,null,null,null,null,null,null,null,null,null,null,"※パートごとに打ち合わせ"]
[]
[null,null,null,null,null,null,null,null,null,null,null,null,null,"競技開始　　",null,null,null,9,"時","00","分"]
[]
[null,null,6,"その他"]
[]
[null,null,"・","各日、役員係で受付を行い審判手帳を提出してください。"]
[null,null,"・","競技場内では公認審判章及び受付で配布されるIDを身につけてください。"]
[null,null,"・","審判業務中、選手への声掛けなど【助力】とみなされる行動がないようにしてください。"]
[null,null,"・","経費削減、業務縮減から礼状の発送を省略させていただきます。ご理解ください。"]

{"sheet":"学校長","index":2,"n_rows":52,"n_cols":29,"rows_kept":52,"cut":false,"hidden":false,"merged":[[17,6,17,10],[9,29,10,29],[9,30,10,30],[2,2,2,7],[9,27,10,27],[9,28,10,28],[2,27,5,27],[16,16,16,20]]}
[null,null,null,null,null,null,null,null,null,null,null,null,null,null,null,null,null,null,"令和６年　７月吉日"]
[null,null,null,null,null,null,null,null,null,null,null,null,null,null,null,null,null,null,null,null,null,null,null,null,null,null,null,"番号"]
[null,null,{"$f":"IF(VLOOKUP(AB3,審判員名簿!$A$2:$D$233,4,FALSE)=0,\"\",VLOOKUP(AB3,審判員名簿!$A$2:$D$233,4,FALSE))","v":{"$error":"#N/A"}},null,null,null,null,null,null,null,null,null,null,null,null,null,null,null,null,null,null,null,null,null,null,null,null,null,"."]
[null,null,null,null,"　　校　長　様"]
[null,null,null,null,null,null,null,null,null,null,null,null,null,null,null,"一般財団法人北海道陸上競技協会"]
[null,null,null,null,null,null,null,null,null,null,null,null,null,null,null,null,"会　長",null,"　板　谷　良　久"]
[null,null,null,null,null,null,null,null,null,null,null,null,null,null,null,null,"釧路地方陸上競技協会"]
[null,null,null,null,null,null,null,null,null,null,null,null,null,null,null,null,"会　長",null,"　間　宮　政　喜"]
[]
[]
[null,null,null,"令和６年度国民スポーツ大会北海道代表選手選考会　競技役員の派遣依頼について"]
[]
[null,"　大暑の候、益々ご清栄のこととお喜び申し上げます。日頃より北海道陸上競技協会並びに当協会"]
[null,"の事業運営に際しまして、ご支援とご協力を賜り、厚く御礼申し上げます。"]
[null,"　さて、令和６年度国民スポーツ大会北海道代表選手選考会は、釧路市民陸上競技場を会場として、"]
[null,"下記の日程で開催することとなりました。"]
[null,"　ここに大会開催のご案内を申し上げますとともに、貴下職員",null,null,null,null,null,null,null,null,null,null,null,null,null,null,{"$f":"IF(VLOOKUP(AB3,審判員名簿!$A$2:$C$233,3,FALSE)=0,\"\",VLOOKUP(AB3,審判員名簿!$A$2:$C$233,3,FALSE))","v":{"$error":"#N/A"}},null,null,null,null,"様を"]
[null,"本大会の競技役員",null,null,null,null,{"$f":"IF(VLOOKUP(AB3,審判員名簿!$A$2:$C$233,2,FALSE)=0,\"\",VLOOKUP(AB3,審判員名簿!$A$2:$C$233,2,FALSE))","v":{"$error":"#N/A"}},null,null,null,null,"としてご委嘱いたしますので、派遣くださるよう"]
[null,"お願い申し上げます。"]
[null,"　時節柄ご多忙のこととは存じますが、ご了承の上、本大会の運営業務へのご協力を賜りますよう"]
[null,"お願い申し上げます。"]
[null,null,null,null,null,null,null,null,null,null,null,null,"記"]
[]
[null,null,1,"大会名",null,null,"令和６年度国民スポーツ大会北海道代表選手選考会"]
[]
[null,null,2,"会　期",null,null,"令和６年　８月１０日（土）・１１日（日）"]
[]
[null,null,3,"会　場",null,null,"釧路市民陸上競技場　〒085-0064　北海道釧路市広里13　 TEL 0154-37-7772"]
[]
[null,null,4,"主　管",null,null,"釧路地方陸上競技協会"]
[]
[null,null,5,"日　程",null,null,"【１日目】８月１０日（土）",null,null,null,null,null,null,"審判集合",null,null,null,7,"時","50","分"]
[]
[null,null,null,null,null,null,null,null,null,null,null,null,null,"主任審判打合せ",null,null,null,8,"時","00","分"]
[]
[null,null,null,null,null,null,null,null,null,null,null,null,null,"開始式",null,null,null,8,"時","10","分"]
[]
[null,null,null,null,null,null,null,null,null,null,null,null,null,"審判打合せ  ",null,null,null,"開始式終了後"]
[]
[null,null,null,null,null,null,null,null,null,null,null,null,null,null,"※パートごとに打ち合わせ"]
[]
[null,null,null,null,null,null,null,null,null,null,null,null,null,"競技開始　　",null,null,null,9,"時","00","分"]
[]
[null,null,null,null,null,null,"【２日目】８月１１日（日）",null,null,null,null,null,null,"審判集合",null,null,null,7,"時","50","分"]
[]
[null,null,null,null,null,null,null,null,null,null,null,null,null,"主任審判打合せ  ",null,null,null,8,"時","00","分"]
[]
[null,null,null,null,null,null,null,null,null,null,null,null,null,"審判打合せ  ",null,null,null,8,"時","10","分"]
[]
[null,null,null,null,null,null,null,null,null,null,null,null,null,null,"※パートごとに打ち合わせ"]
[]
[null,null,null,null,null,null,null,null,null,null,null,null,null,"競技開始　　",null,null,null,9,"時","00","分"]

{"sheet":"所属長","index":3,"n_rows":50,"n_cols":29,"rows_kept":50,"cut":false,"hidden":false,"merged":[[9,29,10,29],[9,30,10,30],[16,16,16,20],[17,6,17,10],[2,2,2,7],[2,27,5,27],[9,27,10,27],[9,28,10,28]]}
[null,null,null,null,null,null,null,null,null,null,null,null,null,null,null,null,null,null,"令和６年　７月吉日"]
[null,null,null,null,null,null,null,null,null,null,null,null,null,null,null,null,null,null,null,null,null,null,null,null,null,null,null,"番号"]
[null,null,{"$f":"IF(VLOOKUP(AB3,審判員名簿!$A$2:$D$233,4,FALSE)=0,\"\",VLOOKUP(AB3,審判員名簿!$A$2:$D$233,4,FALSE))","v":{"$error":"#N/A"}},null,null,null,null,null,null,null,null,null,null,null,null,null,null,null,null,null,null,null,null,null,null,null,null,null,"."]
[null,null,null,null,"　　所属長　様"]
[null,null,null,null,null,null,null,null,null,null,null,null,null,null,null,"一般財団法人北海道陸上競技協会"]
[null,null,null,null,null,null,null,null,null,null,null,null,null,null,null,null,"会　長",null,"　板　谷　良　久"]
[null,null,null,null,null,null,null,null,null,null,null,null,null,null,null,null,"釧路地方陸上競技協会"]
[null,null,null,null,null,null,null,null,null,null,null,null,null,null,null,null,"会　長",null,"　間　宮　政　喜"]
[]
[]
[null,null,null,"令和６年度国民スポーツ大会北海道代表選手選考会　競技役員の派遣依頼について"]
[]
[null,"　大暑の候、益々ご清栄のこととお喜び申し上げます。日頃より北海道陸上競技協会並びに当協会"]
[null,"の事業運営に際しまして、ご支援とご協力を賜り、厚く御礼申し上げます。"]
[null,"　さて、令和６年度国民スポーツ大会北海道代表選手選考会は、釧路市民陸上競技場を会場として、"]
[null,"下記の日程で開催することとなりました。"]
[null,"　ここに大会開催のご案内を申し上げますとともに、貴下職員",null,null,null,null,null,null,null,null,null,null,null,null,null,null,{"$f":"IF(VLOOKUP(AB3,審判員名簿!$A$2:$C$233,3,FALSE)=0,\"\",VLOOKUP(AB3,審判員名簿!$A$2:$C$233,3,FALSE))","v":{"$error":"#N/A"}},null,null,null,null,"様を"]
[null,"本大会の競技役員",null,null,null,null,{"$f":"IF(VLOOKUP(AB3,審判員名簿!$A$2:$C$233,2,FALSE)=0,\"\",VLOOKUP(AB3,審判員名簿!$A$2:$C$233,2,FALSE))","v":{"$error":"#N/A"}},null,null,null,null,"としてご委嘱いたしますので、派遣くださるよう"]
[null,"お願い申し上げます。"]
[null,"　時節柄ご多忙のこととは存じますが、ご了承の上、本大会の運営業務へのご協力を賜りますよう"]
[null,"お願い申し上げます。"]
[null,null,null,null,null,null,null,null,null,null,null,null,"記"]
[]
[null,null,1,"大会名",null,null,"令和６年度国民スポーツ大会北海道代表選手選考会"]
[]
[null,null,2,"会　期",null,null,"令和６年　８月１０日（土）・１１日（日）"]
[]
[null,null,3,"会　場",null,null,"釧路市民陸上競技場　〒085-0064　北海道釧路市広里13　 TEL 0154-37-7772"]
[]
[null,null,4,"主　管",null,null,"釧路地方陸上競技協会"]
[]
[null,null,5,"日　程",null,null,"【１日目】８月１０日（土）",null,null,null,null,null,null,"審判集合",null,null,null,7,"時","50","分"]
[]
[null,null,null,null,null,null,null,null,null,null,null,null,null,"主任審判打合せ",null,null,null,8,"時","00","分"]
[]
[null,null,null,null,null,null,null,null,null,null,null,null,null,"開始式",null,null,null,8,"時","10","分"]
[]
[null,null,null,null,null,null,null,null,null,null,null,null,null,"審判打合せ  ",null,null,null,"開始式終了後"]
[]
[null,null,null,null,null,null,null,null,null,null,null,null,null,null,"※パートごとに打ち合わせ"]
[]
[null,null,null,null,null,null,null,null,null,null,null,null,null,"競技開始　　",null,null,null,9,"時","00","分"]
[]
[null,null,null,null,null,null,"【２日目】８月１１日（日）",null,null,null,null,null,null,"審判集合",null,null,null,7,"時","50","分"]
[]
[null,null,null,null,null,null,null,null,null,null,null,null,null,"主任審判打合せ  ",null,null,null,8,"時","00","分"]
[]
[null,null,null,null,null,null,null,null,null,null,null,null,null,"審判打合せ  ",null,null,null,8,"時","10","分"]
[]
[null,null,null,null,null,null,null,null,null,null,null,null,null,null,"※パートごとに打ち合わせ"]